cancel
Showing results for 
Search instead for 
Did you mean: 
Reply
OvalmanPA
Paper Tape
Posts: 3
Registered: ‎07-28-2017
Location: US
Views: 411
Message 1 of 5

700-25ISH storage device error code

So my LSC just got done running and popped a result code of WHD01V01I-WM7BJM on the second hard drive. Any idea what this is trying to tell me? Says it failed the Targeted Read Test, SMART Short Self Test, and the SMART Drive Self Test. Any help is appreciated. I'm just wondering if this is indicating the first signs of a drive failure?

sclexman
Bit Torrent
Posts: 4,580
Registered: ‎11-22-2011
Location: US
Views: 394
Message 2 of 5

Re: 700-25ISH storage device error code

Your HDD is dieing.  Backup all loved data on second drive.

This post has the same EXACT error code.

https://forums.lenovo.com/t5/Lenovo-B-and-G-Series-Notebooks/G50-70-gets-solution-center-code-but-no...

 

Post c\programdata\lenovo\ldiag\ldiag.log for further assistance.

OvalmanPA
Paper Tape
Posts: 3
Registered: ‎07-28-2017
Location: US
Views: 383
Message 3 of 5

Re: 700-25ISH storage device error code

BTW this should still be under warranty I'm assuming so if it needs to be replaced hopefully they can send me a new one.

sclexman
Bit Torrent
Posts: 4,580
Registered: ‎11-22-2011
Location: US
Views: 360
Message 4 of 5

Re: 700-25ISH storage device error code

START TESTS
20170728T214750UTC START SMART_STATUS_TEST
20170728T214750UTC STOP SMART_STATUS_TEST SUCCESS 0.09 S
20170728T214750UTC START TARGETED_READ_TEST
20170728T214758UTC ERROR READING_SECTOR 98777570
20170728T214758UTC STOP TARGETED_READ_TEST FAILED 8.02 S
20170728T214758UTC START RANDOM_SEEK_TEST
20170728T214915UTC STOP RANDOM_SEEK_TEST SUCCESS 77.03 S
20170728T214915UTC START FUNNEL_SEEK_TEST
20170728T215014UTC STOP FUNNEL_SEEK_TEST SUCCESS 58.72 S
20170728T215014UTC START SHORT_SELF_TEST
20170728T215024UTC ERROR READ_ERROR_DETECTED
20170728T215025UTC ERROR READING_SECTOR 98777648
20170728T215025UTC STOP SHORT_SELF_TEST FAILED 10.36 S
20170728T215025UTC START DRIVE_SELF_TEST
20170728T215035UTC ERROR READ_ERROR_DETECTED
20170728T215035UTC ERROR READING_SECTOR 98777648
20170728T215035UTC STOP DRIVE_SELF_TEST FAILED 10.36 S
STOP TESTS WHD01V01I-WM7BJM

==

Both of your drives were good june 28.

=

July 28:

samsung fine, your C drive

seagate, 2nd drive is headed south.

DISPLAY_NAME: ST1000DM003-1ER162 - 931.51 GBs

https://www.amazon.com/Seagate-BarraCuda-3-5-Inch-Internal-ST1000DM010/dp/B01LNJBA2I/ref=sr_1_2?ie=U...

If under warranty, cool

Use windows backup to get loved data from drive 2 to external HDD-USB asap.

You can get 2nd opinion by running seagate diagnostics:

http://www.seagate.com/support/downloads/seatools/

OvalmanPA
Paper Tape
Posts: 3
Registered: ‎07-28-2017
Location: US
Views: 344
Message 5 of 5

Re: 700-25ISH storage device error code

Well I'm glad this is at least the second drive rather than the one Windows is on so that should make things a bit easier. I'll have to contact support as I believe there is still about 120 days left of warranty. Thanks for the info.

Check out current deals!


Shop current deals

Top Kudoed Authors